BDBM291147 US9580396, Example 5j
SMILES CN1C(=N)N[C@@]2(CCCc3ccc(NC(=O)c4ncc(cn4)C(F)(F)F)cc23)CS1(=O)=O
InChI Key InChIKey=ITULTALJGSVECT-SFHVURJKSA-N
Data  2 KI
  Tab Delimited (TSV)   2D SDfile   Computed 3D by Vconf -m prep SDfile
Find this compound or compounds like it in BindingDB:
Activity Spreadsheet -- Enzyme Inhibition Constant Data from BindingDB
Found 1 hit for monomerid = 291147
TargetBeta-secretase 1(Homo sapiens (Human))
Merck Sharp & Dohme
US Patent
LigandPNGBDBM291147(US9580396, Example 5j)
Affinity DataKi:  468nMpH: 5.0Assay Description:A homogeneous time-resolved FRET assay can be used to determine IC50 values for inhibitors of the soluble human BACE1 catalytic domain. This assay mo...
Ligand InfoPC cidPC sid
In DepthDetails US Patent